{"text_format":"1","workbook":"xlsx","n_sheets":6,"sheets":["Simulacion","par","fallecimiento+total","invalidez_total","invalidez_absoluta","fall_accidente"],"not_rendered":{"charts":0,"images":7,"macros":1,"external_links":1,"defined_names":41,"comments":3,"pivot_tables":0},"unopened":[],"bounds":{"document_bytes":16777216,"sheet_cells":100000,"rows_first":2000,"rows_last":500,"rows_between":2000,"halvings":0,"cell_chars":16384,"cell_head_chars":4096},"cells_cut":0,"cells_raw":0,"read":"whole","date_system":"1900"}

{"sheet":"Simulacion","index":0,"n_rows":188,"n_cols":15,"rows_kept":188,"cut":false,"hidden":false,"merged":[[59,2,59,9],[34,2,34,6],[39,2,39,6],[44,2,44,6],[49,2,49,6],[1,2,1,10],[28,6,28,10],[54,2,54,9],[26,7,26,9],[17,2,17,9],[18,2,18,9],[20,2,21,9],[6,4,6,9],[24,2,24,8]]}
[]
[]
[]
[]
[]
[]
[null,null,{"$f":"\"- Proyecto realizado para\"","v":"- Proyecto realizado para"},":"]
[null,null,{"$f":"\"- Fecha de nacimiento del Titular\"","v":"- Fecha de nacimiento del Titular"},":"]
[]
[]
[null,null,{"$f":"\"- Fecha de Efecto\"","v":"- Fecha de Efecto"},":"]
[null,null,{"$f":"\"- Capital a Asegurar\"","v":"- Capital a Asegurar"},":"]
[null,null,{"$f":"\"- Recargo por sobreprima cobertura fallecimiento\"","v":"- Recargo por sobreprima cobertura fallecimiento"},":",0]
[null,null,{"$f":"\"- Recargo por sobreprima cobertura invalidez\"","v":"- Recargo por sobreprima cobertura invalidez"},":",0]
[]
[null,null,"3. Coberturas del seguro"]
[null,null,"- Prestación principal: fallecimiento por cualquier causa"]
[null,null,"- Prestaciones complementarias opcionales: invalidez permanente total o absoluta, y fallecimiento por accidente y por accidente de circulación (doble / triple capital)"]
[null,null,"- Incorpora una Prestación de supervivencia y fidelidad que se abona cada tres periodos de vigencia sucesivos, cuando el asegurado haya renovado la póliza sin causar otra prestación:"]
[null,null,"    * primer abono: 1% de la prima comercial que se abona al final del periodo de vigencia de la segunda renovación"]
{"$rows_left_out":169}
{"sheet":"par","index":1,"n_rows":81,"n_cols":10,"rows_kept":81,"cut":false,"hidden":true,"merged":[]}
[]
["Absoluta"]
["Tasas por 1.000"]
["% hombre",0.5,{"$f":"\" <- Proporcion Qx en fallecimiento y Ix en Invalidez\"","v":" <- Proporcion Qx en fallecimiento y Ix en Invalidez"}]
[]
["ajuste total",1.7,{"$f":"\" <- Recargo sobre las tasas de Invalidez Absoluta para obtener la Tasa de Invalidez Total\"","v":" <- Recargo sobre las tasas de Invalidez Absoluta para obtener la Tasa de Invalidez Total"}]
["minimo IAP",2.0000000000000001E-4]
["minimo ITP",4.4999999999999999E-4]
[]
["edad ajuste",75,{"$f":"\" <- Edad Límite de aseguramiento\"","v":" <- Edad Límite de aseguramiento"}]
[]
["Reduccuon PASEM",1,{"$f":"\" <- Factor Ajuste a la Q (Varon+Mujer) hasta la edad de de Ajuste\"","v":" <- Factor Ajuste a la Q (Varon+Mujer) hasta la edad de de Ajuste"}]
["minimo fall",0]
[]
[]
["% premio supervivencia año",0.01]
[]
[null,null,null,"Gastos Internos",null,"Gastos Externos"]
["Tasa de gastos",0.36,null,0.16,null,0.2]
[]
{"$rows_left_out":62}
{"sheet":"fallecimiento+total","index":2,"n_rows":124,"n_cols":27,"rows_kept":124,"cut":false,"hidden":true,"merged":[]}
["EDAD","fall pasem2019 no relacionada individual  1  ord  m","fall pasem2019 no relacionada individual  1  ord  y","Tasa Fallecimiento PASEM\n ajustada con la Correccion por Edad","Invalidez Absoluta Permanente\n ajustada con la Correccion por Edad","Invalidez Total Permanente\n ajustada con la Correccion por Edad","Tasa fallecimiento por accidente + tasa fallecimiento por accidente de circulacion","tpx fallecimiento PASEM","V^0,5","V^0,5      fraccionaria","ANUAL FALL","ANUAL IAP","ANUAL ITP","ANUAL FALL ACC","FRACCIONARIA TRIM. FALL.","FRACCIONARIA TRIM. IAP","FRACCIONARIA TRIM. ITP","FRACCIONARIA TRIM. ACC","Prima Trim.\nFallec.","Prima Trim.\nIAP","Prima Trim.\nITP","Prima Trim.\nACC","Prima Trim.\nFall+IAP","Prima Trim.\nFall+ITP","Prima Trim.\nFall+ACC\n","Prima Trim.\nFall+IAP+ACC\n","Prima Trim.\nFall+ITP+ACC\n"]
[18,2.5961780261990263E-4,1.1364121399635588E-4,{"$f":"+MAX(min_fall,(+B2*hombre+C2*(1-hombre)))","v":1.8662950830812926E-4},{"$f":"+VLOOKUP(A2,invalidez_absoluta!A2:E54,5,FALSE)","v":2.0000000000000001E-4},{"$f":"+VLOOKUP(A2,invalidez_total!A2:E54,5,FALSE)","v":4.4999999999999999E-4},{"$f":"+VLOOKUP(A2,fall_accidente!$A$2:$D$59,4,FALSE)","v":6.7500000000000004E-4},{"$f":"1-D2","v":0.99981337049169183},{"$f":"+(1/(1+interes)^(1/2))","v":1},{"$f":"+(1/(1+interes)^(1/(2*4)))","v":1},{"$f":"ROUND((+$D2*$I2)/(1-GastosN)*capital,2)","v":29.16},{"$f":"ROUND((+$E2*$I2)/(1-GastosN)*capital,2)","v":31.25},{"$f":"ROUND((+$F2*$I2)/(1-GastosN)*capital,2)","v":70.31},{"$f":"ROUND((+$G2*$I2)/(1-GastosN)*capital,2)","v":105.47},{"$f":"ROUND((1+0.02)*(+($D2/4)*$J2)/(1-GastosN)*capital,2)","v":7.44},{"$f":"ROUND((1+0.02)*(+($E2/4)*$J2)/(1-GastosN)*capital,2)","v":7.97},{"$f":"ROUND((1+0.02)*(+($F2/4)*$J2)/(1-GastosN)*capital,2)","v":17.93},{"$f":"ROUND((1+0.02)*(+($G2/4)*$J2)/(1-GastosN)*capital,2)","v":26.89},{"$f":"ROUND(((K2)/4)*1.01,2)","v":7.36},{"$f":"ROUND(((L2)/4)*1.01,2)","v":7.89},{"$f":"ROUND(((M2)/4)*1.01,2)","v":17.75},{"$f":"ROUND(((N2)/4)*1.01,2)","v":26.63},{"$f":"+S2+T2","v":15.25},{"$f":"ROUND(S2+U2,2)","v":25.11},{"$f":"+S2+V2","v":33.99},{"$f":"+S2+T2+V2","v":41.879999999999995},{"$f":"+S2+U2+V2","v":51.739999999999995}]
[19,2.6491973585609526E-4,1.1036493254947701E-4,1.8764233420278612E-4,{"$f":"+VLOOKUP(A3,invalidez_absoluta!A3:E55,5,FALSE)","v":2.0000000000000001E-4},{"$f":"+VLOOKUP(A3,invalidez_total!A3:E55,5,FALSE)","v":4.4999999999999999E-4},{"$f":"+VLOOKUP(A3,fall_accidente!$A$2:$D$59,4,FALSE)","v":6.7500000000000004E-4},{"$f":"1-D3","v":0.99981235766579724},1,1,{"$f":"ROUND((+$D3*$I3)/(1-GastosN)*capital,2)","v":29.32},31.25,70.31,105.47,7.48,7.97,17.93,26.89,{"$f":"ROUND(((K3)/4)*1.01,2)","v":7.4},{"$f":"ROUND(((L3)/4)*1.01,2)","v":7.89},{"$f":"ROUND(((M3)/4)*1.01,2)","v":17.75},{"$f":"ROUND(((N3)/4)*1.01,2)","v":26.63},{"$f":"+S3+T3","v":15.29},{"$f":"ROUND(S3+U3,2)","v":25.15},{"$f":"+S3+V3","v":34.03},{"$f":"+S3+T3+V3","v":41.92},{"$f":"+S3+U3+V3","v":51.78}]
[20,2.7145176510918177E-4,1.0908295904422492E-4,1.9026736207670335E-4,{"$f":"+VLOOKUP(A4,invalidez_absoluta!A4:E56,5,FALSE)","v":2.0000000000000001E-4},{"$f":"+VLOOKUP(A4,invalidez_total!A4:E56,5,FALSE)","v":4.4999999999999999E-4},{"$f":"+VLOOKUP(A4,fall_accidente!$A$2:$D$59,4,FALSE)","v":6.7500000000000004E-4},0.99980973263792328,1,1,29.73,31.25,70.31,105.47,7.58,7.97,17.93,26.89,7.51,7.89,17.75,26.63,15.399999999999999,25.26,34.14,42.03,51.89]
[21,2.7841346832149306E-4,1.0911586532450584E-4,1.9376466682299946E-4,{"$f":"+VLOOKUP(A5,invalidez_absoluta!A5:E57,5,FALSE)","v":2.0000000000000001E-4},{"$f":"+VLOOKUP(A5,invalidez_total!A5:E57,5,FALSE)","v":4.4999999999999999E-4},{"$f":"+VLOOKUP(A5,fall_accidente!$A$2:$D$59,4,FALSE)","v":6.7500000000000004E-4},0.99980623533317703,1,1,30.28,31.25,70.31,105.47,7.72,7.97,17.93,26.89,7.65,7.89,17.75,26.63,15.54,25.4,34.28,42.17,52.03]
[22,2.8651023873067419E-4,1.1038695485392943E-4,1.9844859679230182E-4,{"$f":"+VLOOKUP(A6,invalidez_absoluta!A6:E58,5,FALSE)","v":2.0000000000000001E-4},{"$f":"+VLOOKUP(A6,invalidez_total!A6:E58,5,FALSE)","v":4.4999999999999999E-4},{"$f":"+VLOOKUP(A6,fall_accidente!$A$2:$D$59,4,FALSE)","v":6.7500000000000004E-4},0.9998015514032077,1,1,31.01,31.25,70.31,105.47,7.91,7.97,17.93,26.89,7.83,7.89,17.75,26.63,15.719999999999999,25.58,34.46,42.349999999999994,52.209999999999994]
[23,2.938861846499591E-4,1.1189579855401537E-4,2.0289099160198724E-4,{"$f":"+VLOOKUP(A7,invalidez_absoluta!A7:E59,5,FALSE)","v":2.0000000000000001E-4},{"$f":"+VLOOKUP(A7,invalidez_total!A7:E59,5,FALSE)","v":4.4999999999999999E-4},{"$f":"+VLOOKUP(A7,fall_accidente!$A$2:$D$59,4,FALSE)","v":6.7500000000000004E-4},0.99979710900839802,1,1,31.7,31.25,70.31,105.47,8.08,7.97,17.93,26.89,8,7.89,17.75,26.63,15.89,25.75,34.629999999999995,42.519999999999996,52.379999999999995]
[24,3.005620622963381E-4,1.1348882981953143E-4,2.0702544605793476E-4,{"$f":"+VLOOKUP(A8,invalidez_absoluta!A8:E60,5,FALSE)","v":2.0000000000000001E-4},{"$f":"+VLOOKUP(A8,invalidez_total!A8:E60,5,FALSE)","v":4.4999999999999999E-4},{"$f":"+VLOOKUP(A8,fall_accidente!$A$2:$D$59,4,FALSE)","v":6.7500000000000004E-4},0.99979297455394212,1,1,32.35,31.25,70.31,105.47,8.25,7.97,17.93,26.89,8.17,7.89,17.75,26.63,16.059999999999999,25.92,34.799999999999997,42.69,52.55]
[25,3.0551705904306747E-4,1.147624188573823E-4,2.1013973895022488E-4,{"$f":"+VLOOKUP(A9,invalidez_absoluta!A9:E61,5,FALSE)","v":2.0000000000000001E-4},{"$f":"+VLOOKUP(A9,invalidez_total!A9:E61,5,FALSE)","v":4.4999999999999999E-4},{"$f":"+VLOOKUP(A9,fall_accidente!$A$2:$D$59,4,FALSE)","v":6.7500000000000004E-4},0.99978986026104977,1,1,32.83,31.25,70.31,105.47,8.3699999999999992,7.97,17.93,26.89,8.2899999999999991,7.89,17.75,26.63,16.18,26.04,34.92,42.81,52.67]
[26,3.0689896345341677E-4,1.1514848580763704E-4,2.110237246305269E-4,{"$f":"+VLOOKUP(A10,invalidez_absoluta!A10:E62,5,FALSE)","v":2.0000000000000001E-4},{"$f":"+VLOOKUP(A10,invalidez_total!A10:E62,5,FALSE)","v":4.4999999999999999E-4},{"$f":"+VLOOKUP(A10,fall_accidente!$A$2:$D$59,4,FALSE)","v":6.7500000000000004E-4},0.99978897627536945,1,1,32.97,31.25,70.31,105.47,8.41,7.97,17.93,26.89,8.32,7.89,17.75,26.63,16.21,26.07,34.950000000000003,42.84,52.7]
[27,3.0492299449487876E-4,1.1496089851106714E-4,2.0994194650297295E-4,{"$f":"+VLOOKUP(A11,invalidez_absoluta!A11:E63,5,FALSE)","v":2.0000000000000001E-4},{"$f":"+VLOOKUP(A11,invalidez_total!A11:E63,5,FALSE)","v":4.4999999999999999E-4},{"$f":"+VLOOKUP(A11,fall_accidente!$A$2:$D$59,4,FALSE)","v":6.7500000000000004E-4},0.99979005805349708,1,1,32.799999999999997,31.25,70.31,105.47,8.36,7.97,17.93,26.89,8.2799999999999994,7.89,17.75,26.63,16.169999999999998,26.03,34.909999999999997,42.8,52.66]
[28,2.9983882381978634E-4,1.1450972115347519E-4,2.0717427248663077E-4,{"$f":"+VLOOKUP(A12,invalidez_absoluta!A12:E64,5,FALSE)","v":2.0000000000000001E-4},{"$f":"+VLOOKUP(A12,invalidez_total!A12:E64,5,FALSE)","v":4.4999999999999999E-4},{"$f":"+VLOOKUP(A12,fall_accidente!$A$2:$D$59,4,FALSE)","v":6.7500000000000004E-4},0.99979282572751338,1,1,32.369999999999997,31.25,70.31,105.47,8.25,7.97,17.93,26.89,8.17,7.89,17.75,26.63,16.059999999999999,25.92,34.799999999999997,42.69,52.55]
[29,2.9233138541229556E-4,1.141642442061136E-4,2.0324781480920458E-4,{"$f":"+VLOOKUP(A13,invalidez_absoluta!A13:E65,5,FALSE)","v":2.0000000000000001E-4},{"$f":"+VLOOKUP(A13,invalidez_total!A13:E65,5,FALSE)","v":4.4999999999999999E-4},{"$f":"+VLOOKUP(A13,fall_accidente!$A$2:$D$59,4,FALSE)","v":6.7500000000000004E-4},0.99979675218519082,1,1,31.76,31.25,70.31,105.47,8.1,7.97,17.93,26.89,8.02,7.89,17.75,26.63,15.91,25.77,34.65,42.54,52.4]
[30,2.8607571880324322E-4,1.1536011147274355E-4,2.0071791513799338E-4,{"$f":"+VLOOKUP(A14,invalidez_absoluta!A14:E66,5,FALSE)","v":2.0000000000000001E-4},{"$f":"+VLOOKUP(A14,invalidez_total!A14:E66,5,FALSE)","v":4.4999999999999999E-4},{"$f":"+VLOOKUP(A14,fall_accidente!$A$2:$D$59,4,FALSE)","v":6.7500000000000004E-4},0.99979928208486202,1,1,31.36,31.25,70.31,105.47,8,7.97,17.93,26.89,7.92,7.89,17.75,26.63,15.809999999999999,25.67,34.549999999999997,42.44,52.3]
[31,2.8177303378828708E-4,1.1838394244429328E-4,2.0007848811629019E-4,{"$f":"+VLOOKUP(A15,invalidez_absoluta!A15:E67,5,FALSE)","v":2.0000000000000001E-4},{"$f":"+VLOOKUP(A15,invalidez_total!A15:E67,5,FALSE)","v":4.4999999999999999E-4},{"$f":"+VLOOKUP(A15,fall_accidente!$A$2:$D$59,4,FALSE)","v":6.7500000000000004E-4},0.99979992151188368,1,1,31.26,31.25,70.31,105.47,7.97,7.97,17.93,26.89,7.89,7.89,17.75,26.63,15.78,25.64,34.519999999999996,42.41,52.269999999999996]
[32,2.8168895209615587E-4,1.2419576398881341E-4,2.0294235804248464E-4,{"$f":"+VLOOKUP(A16,invalidez_absoluta!A16:E68,5,FALSE)","v":2.0000000000000001E-4},{"$f":"+VLOOKUP(A16,invalidez_total!A16:E68,5,FALSE)","v":4.4999999999999999E-4},{"$f":"+VLOOKUP(A16,fall_accidente!$A$2:$D$59,4,FALSE)","v":6.7500000000000004E-4},0.99979705764195748,1,1,31.71,31.25,70.31,105.47,8.09,7.97,17.93,26.89,8.01,7.89,17.75,26.63,15.899999999999999,25.76,34.64,42.53,52.39]
[33,2.8849191771294089E-4,1.3409642227271175E-4,2.1129416999282632E-4,{"$f":"+VLOOKUP(A17,invalidez_absoluta!A17:E69,5,FALSE)","v":2.0000000000000001E-4},{"$f":"+VLOOKUP(A17,invalidez_total!A17:E69,5,FALSE)","v":4.4999999999999999E-4},{"$f":"+VLOOKUP(A17,fall_accidente!$A$2:$D$59,4,FALSE)","v":6.7500000000000004E-4},0.99978870583000712,1,1,33.01,31.25,70.31,105.47,8.42,7.97,17.93,26.89,8.34,7.89,17.75,26.63,16.23,26.09,34.97,42.86,52.72]
[34,3.0446747891460215E-4,1.4945682209692581E-4,2.2696215050576398E-4,{"$f":"+VLOOKUP(A18,invalidez_absoluta!A18:E70,5,FALSE)","v":2.0000000000000001E-4},{"$f":"+VLOOKUP(A18,invalidez_total!A18:E70,5,FALSE)","v":4.4999999999999999E-4},{"$f":"+VLOOKUP(A18,fall_accidente!$A$2:$D$59,4,FALSE)","v":6.7500000000000004E-4},0.99977303784949423,1,1,35.46,31.25,70.31,105.47,9.0399999999999991,7.97,17.93,26.89,8.9499999999999993,7.89,17.75,26.63,16.84,26.7,35.58,43.47,53.33]
[35,3.300592467679482E-4,1.7089349189983473E-4,2.5047636933389145E-4,{"$f":"+VLOOKUP(A19,invalidez_absoluta!A19:E71,5,FALSE)","v":2.0968068424990591E-4},{"$f":"+VLOOKUP(A19,invalidez_total!A19:E71,5,FALSE)","v":4.4999999999999999E-4},{"$f":"+VLOOKUP(A19,fall_accidente!$A$2:$D$59,4,FALSE)","v":6.7500000000000004E-4},0.99974952363066616,1,1,39.14,32.76,70.31,105.47,9.98,8.35,17.93,26.89,9.8800000000000008,8.27,17.75,26.63,18.149999999999999,27.63,36.51,44.78,54.260000000000005]
[36,3.6166605077502868E-4,1.9674516749849331E-4,2.7920560913676098E-4,{"$f":"+VLOOKUP(A20,invalidez_absoluta!A20:E72,5,FALSE)","v":2.2970152570559479E-4},{"$f":"+VLOOKUP(A20,invalidez_total!A20:E72,5,FALSE)","v":4.4999999999999999E-4},{"$f":"+VLOOKUP(A20,fall_accidente!$A$2:$D$59,4,FALSE)","v":6.7500000000000004E-4},0.99972079439086325,1,1,43.63,35.89,70.31,105.47,11.12,9.15,17.93,26.89,11.02,9.06,17.75,26.63,20.079999999999998,28.77,37.65,46.709999999999994,55.4]
{"$rows_left_out":105}
{"sheet":"invalidez_total","index":3,"n_rows":54,"n_cols":5,"rows_kept":54,"cut":false,"hidden":true,"merged":[]}
["EDAD","peaimf-2007g (IAP) M","peaimf-2007g (IAP) F","Combinada Proporcion %Hombre%Mujer","sin ajustada con la Correccion por Edad"]
[18,6.3999999999999997E-5,5.3999999999999998E-5,{"$f":"+B2*hombre+C2*(1-hombre)","v":5.8999999999999998E-5},{"$f":"MAX(TsaminT,D2*((ajuste-10)/ajuste)^((A2/10))*ajuste_total)","v":4.4999999999999999E-4}]
[19,7.1000000000000005E-5,6.0000000000000002E-5,{"$f":"+B3*hombre+C3*(1-hombre)","v":6.5500000000000006E-5},4.4999999999999999E-4]
[20,8.0000000000000007E-5,6.4999999999999994E-5,7.25E-5,4.4999999999999999E-4]
[21,8.7999999999999998E-5,7.2000000000000002E-5,7.9999999999999993E-5,4.4999999999999999E-4]
[22,9.8999999999999994E-5,8.0000000000000007E-5,8.9500000000000007E-5,4.4999999999999999E-4]
[23,1.1E-4,8.7999999999999998E-5,9.8999999999999994E-5,4.4999999999999999E-4]
[24,1.22E-4,9.7999999999999997E-5,1.0999999999999999E-4,4.4999999999999999E-4]
[25,1.37E-4,1.08E-4,1.225E-4,4.4999999999999999E-4]
[26,1.5100000000000001E-4,1.1900000000000001E-4,1.35E-4,4.4999999999999999E-4]
[27,1.6899999999999999E-4,1.3200000000000001E-4,1.505E-4,4.4999999999999999E-4]
[28,1.8799999999999999E-4,1.45E-4,1.6649999999999998E-4,4.4999999999999999E-4]
[29,2.0900000000000001E-4,1.6000000000000001E-4,1.8450000000000001E-4,4.4999999999999999E-4]
[30,2.33E-4,1.7799999999999999E-4,2.0550000000000001E-4,4.4999999999999999E-4]
[31,2.5999999999999998E-4,1.9599999999999999E-4,2.2799999999999999E-4,4.4999999999999999E-4]
[32,2.8899999999999998E-4,2.1699999999999999E-4,2.5299999999999997E-4,4.4999999999999999E-4]
[33,3.2200000000000002E-4,2.4000000000000001E-4,2.81E-4,4.4999999999999999E-4]
[34,3.59E-4,2.6400000000000002E-4,3.1150000000000004E-4,4.4999999999999999E-4]
[35,3.9899999999999999E-4,2.9300000000000002E-4,3.4600000000000001E-4,4.4999999999999999E-4]
[36,4.4499999999999997E-4,3.2400000000000001E-4,3.8449999999999997E-4,4.4999999999999999E-4]
{"$rows_left_out":35}
{"sheet":"invalidez_absoluta","index":4,"n_rows":54,"n_cols":5,"rows_kept":54,"cut":false,"hidden":true,"merged":[]}
["EDAD","peaimf-2007g (IAP) M","peaimf-2007g (IAP) F","Combinada Proporcion %Hombre%Mujer","sin ajustada con la Correccion por Edad"]
[18,6.3999999999999997E-5,5.3999999999999998E-5,{"$f":"+B2*hombre+C2*(1-hombre)","v":5.8999999999999998E-5},{"$f":"MAX(TasaminA,D2*((ajuste-10)/ajuste)^((A2/10)))","v":2.0000000000000001E-4}]
[19,7.1000000000000005E-5,6.0000000000000002E-5,6.5500000000000006E-5,2.0000000000000001E-4]
[20,8.0000000000000007E-5,6.4999999999999994E-5,7.25E-5,2.0000000000000001E-4]
[21,8.7999999999999998E-5,7.2000000000000002E-5,7.9999999999999993E-5,2.0000000000000001E-4]
[22,9.8999999999999994E-5,8.0000000000000007E-5,8.9500000000000007E-5,2.0000000000000001E-4]
[23,1.1E-4,8.7999999999999998E-5,9.8999999999999994E-5,2.0000000000000001E-4]
[24,1.22E-4,9.7999999999999997E-5,1.0999999999999999E-4,2.0000000000000001E-4]
[25,1.37E-4,1.08E-4,1.225E-4,2.0000000000000001E-4]
[26,1.5100000000000001E-4,1.1900000000000001E-4,1.35E-4,2.0000000000000001E-4]
[27,1.6899999999999999E-4,1.3200000000000001E-4,1.505E-4,2.0000000000000001E-4]
[28,1.8799999999999999E-4,1.45E-4,1.6649999999999998E-4,2.0000000000000001E-4]
[29,2.0900000000000001E-4,1.6000000000000001E-4,1.8450000000000001E-4,2.0000000000000001E-4]
[30,2.33E-4,1.7799999999999999E-4,2.0550000000000001E-4,2.0000000000000001E-4]
[31,2.5999999999999998E-4,1.9599999999999999E-4,2.2799999999999999E-4,2.0000000000000001E-4]
[32,2.8899999999999998E-4,2.1699999999999999E-4,2.5299999999999997E-4,2.0000000000000001E-4]
[33,3.2200000000000002E-4,2.4000000000000001E-4,2.81E-4,2.0000000000000001E-4]
[34,3.59E-4,2.6400000000000002E-4,3.1150000000000004E-4,2.0000000000000001E-4]
[35,3.9899999999999999E-4,2.9300000000000002E-4,3.4600000000000001E-4,2.0968068424990591E-4]
[36,4.4499999999999997E-4,3.2400000000000001E-4,3.8449999999999997E-4,2.2970152570559479E-4]
{"$rows_left_out":35}
{"sheet":"fall_accidente","index":5,"n_rows":59,"n_cols":4,"rows_kept":59,"cut":false,"hidden":true,"merged":[]}
["EDAD","fall. accidente","fall accidente de circulacion","total"]
[18,3.7500000000000001E-4,2.9999999999999997E-4,{"$f":"+C2+B2","v":6.7500000000000004E-4}]
[19,3.7500000000000001E-4,2.9999999999999997E-4,{"$f":"+C3+B3","v":6.7500000000000004E-4}]
[20,3.7500000000000001E-4,2.9999999999999997E-4,6.7500000000000004E-4]
[21,3.7500000000000001E-4,2.9999999999999997E-4,6.7500000000000004E-4]
[22,3.7500000000000001E-4,2.9999999999999997E-4,6.7500000000000004E-4]
[23,3.7500000000000001E-4,2.9999999999999997E-4,6.7500000000000004E-4]
[24,3.7500000000000001E-4,2.9999999999999997E-4,6.7500000000000004E-4]
[25,3.7500000000000001E-4,2.9999999999999997E-4,6.7500000000000004E-4]
[26,3.7500000000000001E-4,2.9999999999999997E-4,6.7500000000000004E-4]
[27,3.7500000000000001E-4,2.9999999999999997E-4,6.7500000000000004E-4]
[28,3.7500000000000001E-4,2.9999999999999997E-4,6.7500000000000004E-4]
[29,3.7500000000000001E-4,2.9999999999999997E-4,6.7500000000000004E-4]
[30,3.7500000000000001E-4,2.9999999999999997E-4,6.7500000000000004E-4]
[31,3.7500000000000001E-4,2.9999999999999997E-4,6.7500000000000004E-4]
[32,3.7500000000000001E-4,2.9999999999999997E-4,6.7500000000000004E-4]
[33,3.7500000000000001E-4,2.9999999999999997E-4,6.7500000000000004E-4]
[34,3.7500000000000001E-4,2.9999999999999997E-4,6.7500000000000004E-4]
[35,3.7500000000000001E-4,2.9999999999999997E-4,6.7500000000000004E-4]
[36,3.7500000000000001E-4,2.9999999999999997E-4,6.7500000000000004E-4]
{"$rows_left_out":39}